{"text_format":"1","workbook":"xlsx","n_sheets":9,"sheets":["Menu","Grupo","Plan","Do","Check","Act","Dash","Dash (2)","Instruções"],"not_rendered":{"charts":5,"images":11,"macros":1,"external_links":0,"defined_names":15,"comments":0,"pivot_tables":0},"unopened":[],"bounds":{"document_bytes":16777216,"sheet_cells":100000,"rows_first":2000,"rows_last":500,"rows_between":2000,"halvings":0,"cell_chars":16384,"cell_head_chars":4096},"cells_cut":0,"cells_raw":0,"read":"whole","date_system":"1900"}

{"sheet":"Menu","index":0,"n_rows":26,"n_cols":7,"rows_kept":26,"cut":false,"hidden":false,"merged":[[25,4,25,5],[25,6,25,14]]}
[]
[]
[]
[]
[]
[]
[]
[]
[]
[]
[]
[]
[]
[]
[]
[]
[]
[]
[]
[]
[]
[]
[]
[]
[]
[null,null,null,null,"Empresa:",null,"Empresa ABCDE"]

{"sheet":"Grupo","index":1,"n_rows":21,"n_cols":16,"rows_kept":21,"cut":false,"hidden":false,"merged":[[13,1,13,4],[13,6,13,10],[11,1,11,4],[9,2,9,10]]}
[]
[]
[]
[]
[]
[]
[]
[]
[]
[null,"Empresa:",{"$f":"Menu!G26","v":"Empresa ABCDE"}]
[]
[null,"CADASTROS GERAIS\nInsira as informações iniciais para a ferramenta de plano de ação."]
[]
[null,"Equipe de Implantação",null,null,null,null,"Reuniões de Alinhamento"]
[null,"NOME","DEPARTAMENTO","E-MAIL","TELEFONE",null,"DATA","HORA","LOCAL","TEMA","STATUS"]
[null,"João Silva","Comercial","123@123.COM.BR","123@123.COM.BR",null,"2019-05-25","10:00:00","Sala 1","Checagem das Ações","Realizada"]
[null,"Maria Lurdes","RH","123@123.COM.BR","123@123.COM.BR",null,"2019-05-30","10:00:00","Sala 2","Avaliação Resultados","Agendada",null,null,null,{"$f":"IF(B16=\"\",\"\",B16)","v":"João Silva"},{"$f":"COUNTIF(Do!$D$14:$D$100,Grupo!O17)","v":1}]
[null,"José Alves","Suprimentos","123@123.COM.BR","123@123.COM.BR",null,null,null,null,null,"Cancelada",null,null,null,{"$f":"IF(B17=\"\",\"\",B17)","v":"Maria Lurdes"},{"$f":"COUNTIF(Do!$D$14:$D$100,Grupo!O18)","v":1}]
[null,"Pedro Henrique","Marketing","123@123.COM.BR","123@123.COM.BR",null,null,null,null,null,null,null,null,null,"José Alves",{"$f":"COUNTIF(Do!$D$14:$D$100,Grupo!O19)","v":1}]
[null,"Vitor Andrade","Engenharia","123@123.COM.BR","123@123.COM.BR",null,null,null,null,null,null,null,null,null,"Pedro Henrique",{"$f":"COUNTIF(Do!$D$14:$D$100,Grupo!O20)","v":0}]
[null,null,null,null,null,null,null,null,null,null,null,null,null,null,"Vitor Andrade",{"$f":"COUNTIF(Do!$D$14:$D$100,Grupo!O21)","v":1}]

{"sheet":"Plan","index":2,"n_rows":28,"n_cols":24,"rows_kept":28,"cut":false,"hidden":false,"merged":[[11,1,11,2],[13,2,13,3],[9,2,9,9]]}
[]
[]
[]
[]
[]
[]
[]
[]
[]
[null,"Empresa:",{"$f":"Menu!G26","v":"Empresa ABCDE"}]
[]
[null,"PLANEJAR (PLAN)\nInsira as informações necessárias para o primeiro item do ciclo PDCA."]
[]
[null,"Problema a ser analisado:","Não estamos conseguindo atender das demandas de clientes.",null,null,"Indicador Principal:","Aumentar a quantidade de atendimentos mensais.",null,"Sentido do Indicador:","Quanto maior, melhor"]
[]
[null,"POSSÍVEIS CAUSAS","TIPO DE CAUSA","NÍVEL DE CRITICIDADE",null,"Mês","Meta",null,null,null,null,null,"Método","Acumulado","Matéria-Prima","Acumulado","Mão de Obra","Acumulado","Máquina","Acumulado","Medição","Acumulado","Meio Ambiente","Acumulado"]
[null,"Não existe um procedimento de atendimentos.","Método","Alto",null,"JAN",30,null,null,null,null,null,{"$f":"IF($C17=M$16,1,0)","v":1},{"$f":"M17","v":1},{"$f":"IF($C17=O$16,1,0)","v":0},{"$f":"O17","v":0},0,{"$f":"Q17","v":0},0,{"$f":"S17","v":0},0,{"$f":"U17","v":0},0,{"$f":"W17","v":0}]
[null,"Computador está obsoleto.","Máquina","Médio",null,"FEV",30,null,null,null,null,null,{"$f":"IF($C18=M$16,1,0)","v":0},{"$f":"N17+M18","v":1},0,{"$f":"P17+O18","v":0},0,{"$f":"R17+Q18","v":0},1,{"$f":"T17+S18","v":1},0,{"$f":"V17+U18","v":0},0,{"$f":"X17+W18","v":0}]
[null,"Muito calor durante o expediente.","Meio Ambiente","Alto",null,"MAR",30,null,null,null,null,null,0,{"$f":"N18+M19","v":1},0,0,0,0,0,1,0,0,1,1]
[null,"Colaborador desqualificado para a função.","Mão de Obra","Baixo",null,"ABR",40,null,null,null,null,null,0,1,0,0,1,1,0,1,0,0,0,1]
[null,"Causa 5","Mão de Obra","Baixo",null,"MAI",40,null,null,null,null,null,0,1,0,0,1,2,0,1,0,0,0,1]
[null,"Causa 6","Método","Baixo",null,"JUN",40,null,null,null,null,null,1,2,0,0,0,2,0,1,0,0,0,1]
[null,"Causa 7","Matéria-Prima","Baixo",null,"JUL",40,null,null,null,null,null,0,2,1,1,0,2,0,1,0,0,0,1]
[null,"Causa 8","Matéria-Prima","Baixo",null,"AGO",40,null,null,null,null,null,0,2,1,2,0,2,0,1,0,0,0,1]
[null,"Causa 9","Mão de Obra","Baixo",null,"SET",40,null,null,null,null,null,0,2,0,2,1,3,0,1,0,0,0,1]
[null,"Causa 10","Método","Baixo",null,"OUT",40,null,null,null,null,null,1,3,0,2,0,3,0,1,0,0,0,1]
[null,null,null,null,null,"NOV",40]
[null,null,null,null,null,"DEZ",40]

{"sheet":"Do","index":3,"n_rows":100,"n_cols":13,"rows_kept":100,"cut":false,"hidden":false,"merged":[[11,1,11,2],[9,2,9,6]]}
[]
[]
[]
[]
[]
[]
[]
[]
[]
[null,"Empresa:",{"$f":"Menu!G26","v":"Empresa ABCDE"}]
[]
[null,"DO (FAZER)\nInsira as ações que serão necessárias para eliminar as causas levantas."]
[null,"CAUSA","AÇÃO (O QUE)","RESPONSÁVEL (QUEM)","ÁREA (ONDE)","INÍCIO (QUANDO)","PREVISÃO TÉRMINO (QUANDO)"]
[null,"Não existe um procedimento de atendimentos.","Desenvolver um procedimento de atendimentos e treinar os envolvidos.","João Silva",{"$f":"IF(D14=\"\",\"\",VLOOKUP(D14,Grupo!$B$16:$C$20,2,0))","v":"Comercial"},"2020-02-05","2020-04-05",null,null,null,{"$f":"IF(B14=\"\",\"\",IFERROR(VLOOKUP(B14,Plan!$B$17:$D$26,3,0),\"\"))","v":"Alto"},"Alto",{"$f":"COUNTIF($K$14:$K$100,L14)","v":1}]
[null,"Computador está obsoleto.","Orçar e comprar um computador mais atualizado.","José Alves",{"$f":"IF(D15=\"\",\"\",VLOOKUP(D15,Grupo!$B$16:$C$20,2,0))","v":"Suprimentos"},"2020-03-05","2020-04-05",null,null,null,{"$f":"IF(B15=\"\",\"\",IFERROR(VLOOKUP(B15,Plan!$B$17:$D$26,3,0),\"\"))","v":"Médio"},"Médio",{"$f":"COUNTIF($K$14:$K$100,L15)","v":1}]
[null,"Colaborador desqualificado para a função.","Treinamento e acompanhamento do colaborador.","Maria Lurdes",{"$f":"IF(D16=\"\",\"\",VLOOKUP(D16,Grupo!$B$16:$C$20,2,0))","v":"RH"},"2020-03-05","2020-04-05",null,null,null,{"$f":"IF(B16=\"\",\"\",IFERROR(VLOOKUP(B16,Plan!$B$17:$D$26,3,0),\"\"))","v":"Baixo"},"Baixo",2]
[null,"Colaborador desqualificado para a função.","Treinamento e acompanhamento do colaborador.","Vitor Andrade",{"$f":"IF(D17=\"\",\"\",VLOOKUP(D17,Grupo!$B$16:$C$20,2,0))","v":"Engenharia"},"2020-02-05","2020-04-05",null,null,null,{"$f":"IF(B17=\"\",\"\",IFERROR(VLOOKUP(B17,Plan!$B$17:$D$26,3,0),\"\"))","v":"Baixo"}]
[null,null,null,null,{"$f":"IF(D18=\"\",\"\",VLOOKUP(D18,Grupo!$B$16:$C$20,2,0))","v":""},null,null,null,null,null,{"$f":"IF(B18=\"\",\"\",IFERROR(VLOOKUP(B18,Plan!$B$17:$D$26,3,0),\"\"))","v":""}]
[null,null,null,null,{"$f":"IF(D19=\"\",\"\",VLOOKUP(D19,Grupo!$B$16:$C$20,2,0))","v":""},null,null,null,null,null,{"$f":"IF(B19=\"\",\"\",IFERROR(VLOOKUP(B19,Plan!$B$17:$D$26,3,0),\"\"))","v":""}]
[null,null,null,null,{"$f":"IF(D20=\"\",\"\",VLOOKUP(D20,Grupo!$B$16:$C$20,2,0))","v":""},null,null,null,null,null,{"$f":"IF(B20=\"\",\"\",IFERROR(VLOOKUP(B20,Plan!$B$17:$D$26,3,0),\"\"))","v":""}]
[null,null,null,null,{"$f":"IF(D21=\"\",\"\",VLOOKUP(D21,Grupo!$B$16:$C$20,2,0))","v":""},null,null,null,null,null,{"$f":"IF(B21=\"\",\"\",IFERROR(VLOOKUP(B21,Plan!$B$17:$D$26,3,0),\"\"))","v":""}]
[null,null,null,null,{"$f":"IF(D22=\"\",\"\",VLOOKUP(D22,Grupo!$B$16:$C$20,2,0))","v":""},null,null,null,null,null,{"$f":"IF(B22=\"\",\"\",IFERROR(VLOOKUP(B22,Plan!$B$17:$D$26,3,0),\"\"))","v":""}]
[null,null,null,null,{"$f":"IF(D23=\"\",\"\",VLOOKUP(D23,Grupo!$B$16:$C$20,2,0))","v":""},null,null,null,null,null,{"$f":"IF(B23=\"\",\"\",IFERROR(VLOOKUP(B23,Plan!$B$17:$D$26,3,0),\"\"))","v":""}]
[null,null,null,null,{"$f":"IF(D24=\"\",\"\",VLOOKUP(D24,Grupo!$B$16:$C$20,2,0))","v":""},null,null,null,null,null,{"$f":"IF(B24=\"\",\"\",IFERROR(VLOOKUP(B24,Plan!$B$17:$D$26,3,0),\"\"))","v":""}]
[null,null,null,null,{"$f":"IF(D25=\"\",\"\",VLOOKUP(D25,Grupo!$B$16:$C$20,2,0))","v":""},null,null,null,null,null,{"$f":"IF(B25=\"\",\"\",IFERROR(VLOOKUP(B25,Plan!$B$17:$D$26,3,0),\"\"))","v":""}]
[null,null,null,null,{"$f":"IF(D26=\"\",\"\",VLOOKUP(D26,Grupo!$B$16:$C$20,2,0))","v":""},null,null,null,null,null,{"$f":"IF(B26=\"\",\"\",IFERROR(VLOOKUP(B26,Plan!$B$17:$D$26,3,0),\"\"))","v":""}]
[null,null,null,null,{"$f":"IF(D27=\"\",\"\",VLOOKUP(D27,Grupo!$B$16:$C$20,2,0))","v":""},null,null,null,null,null,{"$f":"IF(B27=\"\",\"\",IFERROR(VLOOKUP(B27,Plan!$B$17:$D$26,3,0),\"\"))","v":""}]
[null,null,null,null,{"$f":"IF(D28=\"\",\"\",VLOOKUP(D28,Grupo!$B$16:$C$20,2,0))","v":""},null,null,null,null,null,{"$f":"IF(B28=\"\",\"\",IFERROR(VLOOKUP(B28,Plan!$B$17:$D$26,3,0),\"\"))","v":""}]
[null,null,null,null,{"$f":"IF(D29=\"\",\"\",VLOOKUP(D29,Grupo!$B$16:$C$20,2,0))","v":""},null,null,null,null,null,{"$f":"IF(B29=\"\",\"\",IFERROR(VLOOKUP(B29,Plan!$B$17:$D$26,3,0),\"\"))","v":""}]
[null,null,null,null,{"$f":"IF(D30=\"\",\"\",VLOOKUP(D30,Grupo!$B$16:$C$20,2,0))","v":""},null,null,null,null,null,{"$f":"IF(B30=\"\",\"\",IFERROR(VLOOKUP(B30,Plan!$B$17:$D$26,3,0),\"\"))","v":""}]
[null,null,null,null,{"$f":"IF(D31=\"\",\"\",VLOOKUP(D31,Grupo!$B$16:$C$20,2,0))","v":""},null,null,null,null,null,{"$f":"IF(B31=\"\",\"\",IFERROR(VLOOKUP(B31,Plan!$B$17:$D$26,3,0),\"\"))","v":""}]
[null,null,null,null,{"$f":"IF(D32=\"\",\"\",VLOOKUP(D32,Grupo!$B$16:$C$20,2,0))","v":""},null,null,null,null,null,{"$f":"IF(B32=\"\",\"\",IFERROR(VLOOKUP(B32,Plan!$B$17:$D$26,3,0),\"\"))","v":""}]
[null,null,null,null,{"$f":"IF(D33=\"\",\"\",VLOOKUP(D33,Grupo!$B$16:$C$20,2,0))","v":""},null,null,null,null,null,{"$f":"IF(B33=\"\",\"\",IFERROR(VLOOKUP(B33,Plan!$B$17:$D$26,3,0),\"\"))","v":""}]
[null,null,null,null,{"$f":"IF(D34=\"\",\"\",VLOOKUP(D34,Grupo!$B$16:$C$20,2,0))","v":""},null,null,null,null,null,{"$f":"IF(B34=\"\",\"\",IFERROR(VLOOKUP(B34,Plan!$B$17:$D$26,3,0),\"\"))","v":""}]
[null,null,null,null,{"$f":"IF(D35=\"\",\"\",VLOOKUP(D35,Grupo!$B$16:$C$20,2,0))","v":""},null,null,null,null,null,{"$f":"IF(B35=\"\",\"\",IFERROR(VLOOKUP(B35,Plan!$B$17:$D$26,3,0),\"\"))","v":""}]
[null,null,null,null,{"$f":"IF(D36=\"\",\"\",VLOOKUP(D36,Grupo!$B$16:$C$20,2,0))","v":""},null,null,null,null,null,{"$f":"IF(B36=\"\",\"\",IFERROR(VLOOKUP(B36,Plan!$B$17:$D$26,3,0),\"\"))","v":""}]
[null,null,null,null,{"$f":"IF(D37=\"\",\"\",VLOOKUP(D37,Grupo!$B$16:$C$20,2,0))","v":""},null,null,null,null,null,{"$f":"IF(B37=\"\",\"\",IFERROR(VLOOKUP(B37,Plan!$B$17:$D$26,3,0),\"\"))","v":""}]
[null,null,null,null,{"$f":"IF(D38=\"\",\"\",VLOOKUP(D38,Grupo!$B$16:$C$20,2,0))","v":""},null,null,null,null,null,{"$f":"IF(B38=\"\",\"\",IFERROR(VLOOKUP(B38,Plan!$B$17:$D$26,3,0),\"\"))","v":""}]
[null,null,null,null,{"$f":"IF(D39=\"\",\"\",VLOOKUP(D39,Grupo!$B$16:$C$20,2,0))","v":""},null,null,null,null,null,{"$f":"IF(B39=\"\",\"\",IFERROR(VLOOKUP(B39,Plan!$B$17:$D$26,3,0),\"\"))","v":""}]
[null,null,null,null,{"$f":"IF(D40=\"\",\"\",VLOOKUP(D40,Grupo!$B$16:$C$20,2,0))","v":""},null,null,null,null,null,{"$f":"IF(B40=\"\",\"\",IFERROR(VLOOKUP(B40,Plan!$B$17:$D$26,3,0),\"\"))","v":""}]
{"$rows_left_out":61}
{"sheet":"Check","index":4,"n_rows":100,"n_cols":9,"rows_kept":100,"cut":false,"hidden":false,"merged":[[11,1,11,2],[9,2,9,7]]}
[]
[]
[]
[]
[]
[]
[]
[]
[]
[null,"Empresa:",{"$f":"Menu!G26","v":"Empresa ABCDE"}]
[]
[null,"CHECK (Checar)\nAcompanhe as ações planejadas e se ocorrem conforme previsto."]
[null,"CAUSA","AÇÃO (O QUE)","RESPONSÁVEL (QUEM)","INÍCIO (QUANDO)","PREVISÃO TÉRMINO (QUANDO)","STATUS","OCORREU COMO PLANEJADO?","Observações"]
[null,{"$f":"IF(Do!B14=\"\",\"\",Do!B14)","v":"Não existe um procedimento de atendimentos."},{"$f":"IF(Do!C14=\"\",\"\",Do!C14)","v":"Desenvolver um procedimento de atendimentos e treinar os envolvidos."},{"$f":"IF(Do!D14=\"\",\"\",Do!D14)","v":"João Silva"},{"$f":"IF(Do!F14=\"\",\"\",Do!F14)","v":"2020-02-05"},{"$f":"IF(Do!G14=\"\",\"\",Do!G14)","v":"2020-04-05"},"Concluiu no prazo","Sim"]
[null,{"$f":"IF(Do!B15=\"\",\"\",Do!B15)","v":"Computador está obsoleto."},{"$f":"IF(Do!C15=\"\",\"\",Do!C15)","v":"Orçar e comprar um computador mais atualizado."},{"$f":"IF(Do!D15=\"\",\"\",Do!D15)","v":"José Alves"},{"$f":"IF(Do!F15=\"\",\"\",Do!F15)","v":"2020-03-05"},{"$f":"IF(Do!G15=\"\",\"\",Do!G15)","v":"2020-04-05"},"Concluiu com atraso","Não"]
[null,{"$f":"IF(Do!B16=\"\",\"\",Do!B16)","v":"Colaborador desqualificado para a função."},{"$f":"IF(Do!C16=\"\",\"\",Do!C16)","v":"Treinamento e acompanhamento do colaborador."},{"$f":"IF(Do!D16=\"\",\"\",Do!D16)","v":"Maria Lurdes"},{"$f":"IF(Do!F16=\"\",\"\",Do!F16)","v":"2020-03-05"},{"$f":"IF(Do!G16=\"\",\"\",Do!G16)","v":"2020-04-05"},"Em andamento"]
[null,{"$f":"IF(Do!B17=\"\",\"\",Do!B17)","v":"Colaborador desqualificado para a função."},{"$f":"IF(Do!C17=\"\",\"\",Do!C17)","v":"Treinamento e acompanhamento do colaborador."},{"$f":"IF(Do!D17=\"\",\"\",Do!D17)","v":"Vitor Andrade"},{"$f":"IF(Do!F17=\"\",\"\",Do!F17)","v":"2020-02-05"},{"$f":"IF(Do!G17=\"\",\"\",Do!G17)","v":"2020-04-05"},"Em andamento"]
[null,{"$f":"IF(Do!B18=\"\",\"\",Do!B18)","v":""},{"$f":"IF(Do!C18=\"\",\"\",Do!C18)","v":""},{"$f":"IF(Do!D18=\"\",\"\",Do!D18)","v":""},{"$f":"IF(Do!F18=\"\",\"\",Do!F18)","v":""},{"$f":"IF(Do!G18=\"\",\"\",Do!G18)","v":""}]
[null,{"$f":"IF(Do!B19=\"\",\"\",Do!B19)","v":""},{"$f":"IF(Do!C19=\"\",\"\",Do!C19)","v":""},{"$f":"IF(Do!D19=\"\",\"\",Do!D19)","v":""},{"$f":"IF(Do!F19=\"\",\"\",Do!F19)","v":""},{"$f":"IF(Do!G19=\"\",\"\",Do!G19)","v":""}]
[null,{"$f":"IF(Do!B20=\"\",\"\",Do!B20)","v":""},{"$f":"IF(Do!C20=\"\",\"\",Do!C20)","v":""},{"$f":"IF(Do!D20=\"\",\"\",Do!D20)","v":""},{"$f":"IF(Do!F20=\"\",\"\",Do!F20)","v":""},{"$f":"IF(Do!G20=\"\",\"\",Do!G20)","v":""}]
[null,{"$f":"IF(Do!B21=\"\",\"\",Do!B21)","v":""},{"$f":"IF(Do!C21=\"\",\"\",Do!C21)","v":""},{"$f":"IF(Do!D21=\"\",\"\",Do!D21)","v":""},{"$f":"IF(Do!F21=\"\",\"\",Do!F21)","v":""},{"$f":"IF(Do!G21=\"\",\"\",Do!G21)","v":""}]
[null,{"$f":"IF(Do!B22=\"\",\"\",Do!B22)","v":""},{"$f":"IF(Do!C22=\"\",\"\",Do!C22)","v":""},{"$f":"IF(Do!D22=\"\",\"\",Do!D22)","v":""},{"$f":"IF(Do!F22=\"\",\"\",Do!F22)","v":""},{"$f":"IF(Do!G22=\"\",\"\",Do!G22)","v":""}]
[null,{"$f":"IF(Do!B23=\"\",\"\",Do!B23)","v":""},{"$f":"IF(Do!C23=\"\",\"\",Do!C23)","v":""},{"$f":"IF(Do!D23=\"\",\"\",Do!D23)","v":""},{"$f":"IF(Do!F23=\"\",\"\",Do!F23)","v":""},{"$f":"IF(Do!G23=\"\",\"\",Do!G23)","v":""}]
[null,{"$f":"IF(Do!B24=\"\",\"\",Do!B24)","v":""},{"$f":"IF(Do!C24=\"\",\"\",Do!C24)","v":""},{"$f":"IF(Do!D24=\"\",\"\",Do!D24)","v":""},{"$f":"IF(Do!F24=\"\",\"\",Do!F24)","v":""},{"$f":"IF(Do!G24=\"\",\"\",Do!G24)","v":""}]
[null,{"$f":"IF(Do!B25=\"\",\"\",Do!B25)","v":""},{"$f":"IF(Do!C25=\"\",\"\",Do!C25)","v":""},{"$f":"IF(Do!D25=\"\",\"\",Do!D25)","v":""},{"$f":"IF(Do!F25=\"\",\"\",Do!F25)","v":""},{"$f":"IF(Do!G25=\"\",\"\",Do!G25)","v":""}]
[null,{"$f":"IF(Do!B26=\"\",\"\",Do!B26)","v":""},{"$f":"IF(Do!C26=\"\",\"\",Do!C26)","v":""},{"$f":"IF(Do!D26=\"\",\"\",Do!D26)","v":""},{"$f":"IF(Do!F26=\"\",\"\",Do!F26)","v":""},{"$f":"IF(Do!G26=\"\",\"\",Do!G26)","v":""}]
[null,{"$f":"IF(Do!B27=\"\",\"\",Do!B27)","v":""},{"$f":"IF(Do!C27=\"\",\"\",Do!C27)","v":""},{"$f":"IF(Do!D27=\"\",\"\",Do!D27)","v":""},{"$f":"IF(Do!F27=\"\",\"\",Do!F27)","v":""},{"$f":"IF(Do!G27=\"\",\"\",Do!G27)","v":""}]
[null,{"$f":"IF(Do!B28=\"\",\"\",Do!B28)","v":""},{"$f":"IF(Do!C28=\"\",\"\",Do!C28)","v":""},{"$f":"IF(Do!D28=\"\",\"\",Do!D28)","v":""},{"$f":"IF(Do!F28=\"\",\"\",Do!F28)","v":""},{"$f":"IF(Do!G28=\"\",\"\",Do!G28)","v":""}]
[null,{"$f":"IF(Do!B29=\"\",\"\",Do!B29)","v":""},{"$f":"IF(Do!C29=\"\",\"\",Do!C29)","v":""},{"$f":"IF(Do!D29=\"\",\"\",Do!D29)","v":""},{"$f":"IF(Do!F29=\"\",\"\",Do!F29)","v":""},{"$f":"IF(Do!G29=\"\",\"\",Do!G29)","v":""}]
[null,{"$f":"IF(Do!B30=\"\",\"\",Do!B30)","v":""},{"$f":"IF(Do!C30=\"\",\"\",Do!C30)","v":""},{"$f":"IF(Do!D30=\"\",\"\",Do!D30)","v":""},{"$f":"IF(Do!F30=\"\",\"\",Do!F30)","v":""},{"$f":"IF(Do!G30=\"\",\"\",Do!G30)","v":""}]
[null,{"$f":"IF(Do!B31=\"\",\"\",Do!B31)","v":""},{"$f":"IF(Do!C31=\"\",\"\",Do!C31)","v":""},{"$f":"IF(Do!D31=\"\",\"\",Do!D31)","v":""},{"$f":"IF(Do!F31=\"\",\"\",Do!F31)","v":""},{"$f":"IF(Do!G31=\"\",\"\",Do!G31)","v":""}]
[null,{"$f":"IF(Do!B32=\"\",\"\",Do!B32)","v":""},{"$f":"IF(Do!C32=\"\",\"\",Do!C32)","v":""},{"$f":"IF(Do!D32=\"\",\"\",Do!D32)","v":""},{"$f":"IF(Do!F32=\"\",\"\",Do!F32)","v":""},{"$f":"IF(Do!G32=\"\",\"\",Do!G32)","v":""}]
[null,{"$f":"IF(Do!B33=\"\",\"\",Do!B33)","v":""},{"$f":"IF(Do!C33=\"\",\"\",Do!C33)","v":""},{"$f":"IF(Do!D33=\"\",\"\",Do!D33)","v":""},{"$f":"IF(Do!F33=\"\",\"\",Do!F33)","v":""},{"$f":"IF(Do!G33=\"\",\"\",Do!G33)","v":""}]
[null,{"$f":"IF(Do!B34=\"\",\"\",Do!B34)","v":""},{"$f":"IF(Do!C34=\"\",\"\",Do!C34)","v":""},{"$f":"IF(Do!D34=\"\",\"\",Do!D34)","v":""},{"$f":"IF(Do!F34=\"\",\"\",Do!F34)","v":""},{"$f":"IF(Do!G34=\"\",\"\",Do!G34)","v":""}]
[null,{"$f":"IF(Do!B35=\"\",\"\",Do!B35)","v":""},{"$f":"IF(Do!C35=\"\",\"\",Do!C35)","v":""},{"$f":"IF(Do!D35=\"\",\"\",Do!D35)","v":""},{"$f":"IF(Do!F35=\"\",\"\",Do!F35)","v":""},{"$f":"IF(Do!G35=\"\",\"\",Do!G35)","v":""}]
[null,{"$f":"IF(Do!B36=\"\",\"\",Do!B36)","v":""},{"$f":"IF(Do!C36=\"\",\"\",Do!C36)","v":""},{"$f":"IF(Do!D36=\"\",\"\",Do!D36)","v":""},{"$f":"IF(Do!F36=\"\",\"\",Do!F36)","v":""},{"$f":"IF(Do!G36=\"\",\"\",Do!G36)","v":""}]
[null,{"$f":"IF(Do!B37=\"\",\"\",Do!B37)","v":""},{"$f":"IF(Do!C37=\"\",\"\",Do!C37)","v":""},{"$f":"IF(Do!D37=\"\",\"\",Do!D37)","v":""},{"$f":"IF(Do!F37=\"\",\"\",Do!F37)","v":""},{"$f":"IF(Do!G37=\"\",\"\",Do!G37)","v":""}]
[null,{"$f":"IF(Do!B38=\"\",\"\",Do!B38)","v":""},{"$f":"IF(Do!C38=\"\",\"\",Do!C38)","v":""},{"$f":"IF(Do!D38=\"\",\"\",Do!D38)","v":""},{"$f":"IF(Do!F38=\"\",\"\",Do!F38)","v":""},{"$f":"IF(Do!G38=\"\",\"\",Do!G38)","v":""}]
[null,{"$f":"IF(Do!B39=\"\",\"\",Do!B39)","v":""},{"$f":"IF(Do!C39=\"\",\"\",Do!C39)","v":""},{"$f":"IF(Do!D39=\"\",\"\",Do!D39)","v":""},{"$f":"IF(Do!F39=\"\",\"\",Do!F39)","v":""},{"$f":"IF(Do!G39=\"\",\"\",Do!G39)","v":""}]
[null,{"$f":"IF(Do!B40=\"\",\"\",Do!B40)","v":""},{"$f":"IF(Do!C40=\"\",\"\",Do!C40)","v":""},{"$f":"IF(Do!D40=\"\",\"\",Do!D40)","v":""},{"$f":"IF(Do!F40=\"\",\"\",Do!F40)","v":""},{"$f":"IF(Do!G40=\"\",\"\",Do!G40)","v":""}]
{"$rows_left_out":61}
{"sheet":"Act","index":5,"n_rows":19,"n_cols":15,"rows_kept":19,"cut":false,"hidden":false,"merged":[[13,4,13,8],[11,1,11,14],[9,2,9,14]]}
[]
[]
[]
[]
[]
[]
[]
[]
[]
[null,"Empresa:",{"$f":"Menu!G26","v":"Empresa ABCDE"}]
[]
[null,"ACT (Agir)\nInsira o resultado referentes as metas estabelecidas."]
[]
[null,"O problema foi resolvido?","Sim",null,"Será necessário fazer o ciclo PDCA novamente nesse problema?",null,null,null,null,"Sim"]
[]
[null,null,"JAN","FEV","MAR","ABR","MAI","JUN","JUL","AGO","SET","OUT","NOV","DEZ","TOTAL"]
[null,"Meta",{"$f":"TRANSPOSE(Plan!G17:'Plan'!G28)","v":30},30,30,40,40,40,40,40,40,40,40,40,{"$f":"SUM(_xlfn.ANCHORARRAY(C17))","v":450}]
[null,"Resultado",25,18,32,45,38,45,null,null,null,null,null,null,{"$f":"SUM(C18:N18)","v":203}]
[null,"Diferença",{"$f":"IF(C18=\"\",\"\",C18-C17)","v":-5},{"$f":"IF(D18=\"\",\"\",D18-D17)","v":-12},2,5,-2,5,"","","","","","",-247]

{"sheet":"Dash","index":6,"n_rows":30,"n_cols":20,"rows_kept":30,"cut":false,"hidden":false,"merged":[[19,1,20,4],[23,1,24,4],[12,19,12,20],[12,15,12,18],[10,1,10,2],[10,3,10,20],[12,1,12,2],[12,3,12,13],[15,1,16,4]]}
[]
[]
[]
[]
[]
[]
[]
[]
[]
[]
[null,"Empresa:",null,{"$f":"Menu!G26","v":"Empresa ABCDE"}]
[]
[null,"Problema:",null,{"$f":"Plan!C14","v":"Não estamos conseguindo atender das demandas de clientes."},null,null,null,null,null,null,null,null,null,null,null,"O problema foi resolvido?",null,null,null,{"$f":"Act!C14","v":"Sim"}]
[]
[null,"Causas Levantadas:"]
[null,{"$f":"COUNTA(Plan!B17:B26)","v":10}]
[]
[]
[null,"Ações Planejadas:"]
[null,{"$f":"COUNTA(Do!C14:C100)","v":4}]
[]
[]
[null,"Ajudaram a Resolver o Problema:"]
[null,{"$f":"COUNTIF(Check!H14:H100,\"Sim\")/Dash!B20","v":0.25}]
[]
[]
[]
[null,"Concluiu no Prazo",null,{"$f":"COUNTIF(Check!$G$14:$G$100,Dash!B28)","v":1}]
[null,"Concluiu com Atraso",null,{"$f":"COUNTIF(Check!$G$14:$G$100,Dash!B29)","v":1}]
[null,"Em Andamento",null,{"$f":"COUNTIF(Check!$G$14:$G$100,Dash!B30)","v":2}]

{"sheet":"Dash (2)","index":7,"n_rows":28,"n_cols":28,"rows_kept":28,"cut":false,"hidden":false,"merged":[[22,18,22,22],[24,17,24,21],[26,16,26,20],[26,2,26,6],[16,9,16,13],[18,10,18,14],[20,11,20,15],[22,11,22,15],[24,10,24,14],[26,9,26,13],[16,2,16,6],[18,3,18,7],[20,4,20,8],[22,4,22,8],[24,3,24,7],[16,16,16,20],[18,17,18,21],[20,18,20,22],[10,2,10,3],[12,2,12,3],[12,4,12,14],[12,16,12,19],[10,4,10,23],[12,20,12,23]]}
[]
[]
[]
[]
[]
[]
[]
[]
[]
[]
[null,null,"Empresa:",null,{"$f":"Menu!G26","v":"Empresa ABCDE"}]
[]
[null,null,"Problema:",null,{"$f":"Plan!C14","v":"Não estamos conseguindo atender das demandas de clientes."},null,null,null,null,null,null,null,null,null,null,null,"O problema foi resolvido?",null,null,null,{"$f":"Act!C14","v":"Sim"}]
[]
[]
[null,null,"Método",null,null,null,null,null,null,"Matéria-prima",null,null,null,null,null,null,"Mão de Obra"]
[null,3,{"$f":"IFERROR(INDEX(Plan!$B$17:$W$26,MATCH('Dash (2)'!$B17,Plan!$N$17:$N$26,0),1),\"\")","v":"Causa 10"},null,null,null,null,null,null,{"$f":"IFERROR(INDEX(Plan!$B$17:$W$26,MATCH('Dash (2)'!$B17,Plan!$P$17:$P$26,0),1),\"\")","v":""},null,null,null,null,null,null,{"$f":"IFERROR(INDEX(Plan!$B$17:$W$26,MATCH('Dash (2)'!$B17,Plan!$R$17:$R$26,0),1),\"\")","v":"Causa 9"},null,null,null,null,null,null,null,null,{"$f":"IFERROR(INDEX(Plan!$B$17:$W$26,MATCH('Dash (2)'!$B17,Plan!$N$17:$N$26,0),3),\"\")","v":"Baixo"},{"$f":"IFERROR(INDEX(Plan!$B$17:$W$26,MATCH('Dash (2)'!$B17,Plan!$P$17:$P$26,0),3),\"\")","v":""},{"$f":"IFERROR(INDEX(Plan!$B$17:$W$26,MATCH('Dash (2)'!$B17,Plan!$R$17:$R$26,0),3),\"\")","v":"Baixo"}]
[]
[null,2,null,{"$f":"IFERROR(INDEX(Plan!$B$17:$W$26,MATCH('Dash (2)'!$B19,Plan!$N$17:$N$26,0),1),\"\")","v":"Causa 6"},null,null,null,null,null,null,{"$f":"IFERROR(INDEX(Plan!$B$17:$W$26,MATCH('Dash (2)'!$B19,Plan!$P$17:$P$26,0),1),\"\")","v":"Causa 8"},null,null,null,null,null,null,{"$f":"IFERROR(INDEX(Plan!$B$17:$W$26,MATCH('Dash (2)'!$B19,Plan!$R$17:$R$26,0),1),\"\")","v":"Causa 5"},null,null,null,null,null,null,null,{"$f":"IFERROR(INDEX(Plan!$B$17:$W$26,MATCH('Dash (2)'!$B19,Plan!$N$17:$N$26,0),3),\"\")","v":"Baixo"},{"$f":"IFERROR(INDEX(Plan!$B$17:$W$26,MATCH('Dash (2)'!$B19,Plan!$P$17:$P$26,0),3),\"\")","v":"Baixo"},{"$f":"IFERROR(INDEX(Plan!$B$17:$W$26,MATCH('Dash (2)'!$B19,Plan!$R$17:$R$26,0),3),\"\")","v":"Baixo"}]
[]
[null,1,null,null,{"$f":"IFERROR(INDEX(Plan!$B$17:$W$26,MATCH('Dash (2)'!$B21,Plan!$N$17:$N$26,0),1),\"\")","v":"Não existe um procedimento de atendimentos."},null,null,null,null,null,null,{"$f":"IFERROR(INDEX(Plan!$B$17:$W$26,MATCH('Dash (2)'!$B21,Plan!$P$17:$P$26,0),1),\"\")","v":"Causa 7"},null,null,null,null,null,null,{"$f":"IFERROR(INDEX(Plan!$B$17:$W$26,MATCH('Dash (2)'!$B21,Plan!$R$17:$R$26,0),1),\"\")","v":"Colaborador desqualificado para a função."},null,null,null,null,null,null,{"$f":"IFERROR(INDEX(Plan!$B$17:$W$26,MATCH('Dash (2)'!$B21,Plan!$N$17:$N$26,0),3),\"\")","v":"Alto"},{"$f":"IFERROR(INDEX(Plan!$B$17:$W$26,MATCH('Dash (2)'!$B21,Plan!$P$17:$P$26,0),3),\"\")","v":"Baixo"},{"$f":"IFERROR(INDEX(Plan!$B$17:$W$26,MATCH('Dash (2)'!$B21,Plan!$R$17:$R$26,0),3),\"\")","v":"Baixo"}]
[]
[null,1,null,null,{"$f":"IFERROR(INDEX(Plan!$B$17:$W$26,MATCH('Dash (2)'!$B23,Plan!$T$17:$T$26,0),1),\"\")","v":"Computador está obsoleto."},null,null,null,null,null,null,{"$f":"IFERROR(INDEX(Plan!$B$17:$W$26,MATCH('Dash (2)'!$B23,Plan!$V$17:$V$26,0),1),\"\")","v":""},null,null,null,null,null,null,{"$f":"IFERROR(INDEX(Plan!$B$17:$W$26,MATCH('Dash (2)'!$B23,Plan!$W$17:$W$26,0),1),\"\")","v":"Muito calor durante o expediente."},null,null,null,null,null,null,{"$f":"IFERROR(INDEX(Plan!$B$17:$W$26,MATCH('Dash (2)'!$B23,Plan!$T$17:$T$26,0),3),\"\")","v":"Médio"},{"$f":"IFERROR(INDEX(Plan!$B$17:$W$26,MATCH('Dash (2)'!$B23,Plan!$V$17:$V$26,0),3),\"\")","v":""},{"$f":"IFERROR(INDEX(Plan!$B$17:$W$26,MATCH('Dash (2)'!$B23,Plan!$W$17:$W$26,0),3),\"\")","v":"Alto"}]
[]
[null,2,null,{"$f":"IFERROR(INDEX(Plan!$B$17:$W$26,MATCH('Dash (2)'!$B25,Plan!$T$17:$T$26,0),1),\"\")","v":""},null,null,null,null,null,null,{"$f":"IFERROR(INDEX(Plan!$B$17:$W$26,MATCH('Dash (2)'!$B25,Plan!$V$17:$V$26,0),1),\"\")","v":""},null,null,null,null,null,null,{"$f":"IFERROR(INDEX(Plan!$B$17:$W$26,MATCH('Dash (2)'!$B25,Plan!$W$17:$W$26,0),1),\"\")","v":""},null,null,null,null,null,null,null,{"$f":"IFERROR(INDEX(Plan!$B$17:$W$26,MATCH('Dash (2)'!$B25,Plan!$T$17:$T$26,0),3),\"\")","v":""},{"$f":"IFERROR(INDEX(Plan!$B$17:$W$26,MATCH('Dash (2)'!$B25,Plan!$V$17:$V$26,0),3),\"\")","v":""},{"$f":"IFERROR(INDEX(Plan!$B$17:$W$26,MATCH('Dash (2)'!$B25,Plan!$W$17:$W$26,0),3),\"\")","v":""}]
[]
[null,3,{"$f":"IFERROR(INDEX(Plan!$B$17:$W$26,MATCH('Dash (2)'!$B27,Plan!$T$17:$T$26,0),1),\"\")","v":""},null,null,null,null,null,null,{"$f":"IFERROR(INDEX(Plan!$B$17:$W$26,MATCH('Dash (2)'!$B27,Plan!$V$17:$V$26,0),1),\"\")","v":""},null,null,null,null,null,null,{"$f":"IFERROR(INDEX(Plan!$B$17:$W$26,MATCH('Dash (2)'!$B27,Plan!$W$17:$W$26,0),1),\"\")","v":""},null,null,null,null,null,null,null,null,{"$f":"IFERROR(INDEX(Plan!$B$17:$W$26,MATCH('Dash (2)'!$B27,Plan!$T$17:$T$26,0),3),\"\")","v":""},{"$f":"IFERROR(INDEX(Plan!$B$17:$W$26,MATCH('Dash (2)'!$B27,Plan!$V$17:$V$26,0),3),\"\")","v":""},{"$f":"IFERROR(INDEX(Plan!$B$17:$W$26,MATCH('Dash (2)'!$B27,Plan!$W$17:$W$26,0),3),\"\")","v":""}]
[null,null,"Máquinas",null,null,null,null,null,null,"Medição",null,null,null,null,null,null,"Meio Ambiente"]

{"sheet":"Instruções","index":8,"n_rows":0,"n_cols":0,"rows_kept":0,"cut":false,"hidden":false,"merged":[]}